{"text_format":"1","workbook":"xlsx","n_sheets":21,"sheets":["Disclaimer","Instructions","Summary","Configure System","Configure Module 1","Configure Module 2","Configure Module 3","Configure Module 4","Compute_Module","Chassis_Definition","Processors","Memory","PCIe","SSD","Peripherals","Taylor Pass_Normal","Taylor Pass_Fan Fail","Walker Pass_Normal","Walker Pass_Fan Fail","Revision","Macro1"],"not_rendered":{"charts":9,"images":2,"macros":1,"external_links":3,"defined_names":393,"comments":0,"pivot_tables":0},"unopened":[],"bounds":{"document_bytes":16777216,"sheet_cells":100000,"rows_first":2000,"rows_last":500,"rows_between":2000,"halvings":0,"cell_chars":16384,"cell_head_chars":4096},"cells_cut":0,"cells_raw":0,"read":"whole","date_system":"1900"}

{"sheet":"Disclaimer","index":0,"n_rows":0,"n_cols":0,"rows_kept":0,"cut":false,"hidden":false,"merged":[]}

{"sheet":"Instructions","index":1,"n_rows":40,"n_cols":1,"rows_kept":40,"cut":false,"hidden":false,"merged":[]}
["        Power Budget Instructions"]
[]
[]
[]
[]
[]
{"$rows_left_out":35}
{"sheet":"Summary","index":2,"n_rows":30,"n_cols":15,"rows_kept":30,"cut":false,"hidden":false,"merged":[[0,1,0,3],[15,0,15,3],[24,11,26,11],[27,11,29,11],[6,8,6,9]]}
["Power Budget",null,null,null,"4 nodes -> 3+0\n3 nodes -> 2+1\n2 nodes -> 2+1\n1 node -> 1+2",null,null,"Product Code Summary"]
["System Totals"," 12V\nMain\n(Amps)","12V\nStby\n(Amps)","Total System Watts ","Deshabilitar input voltage 115V celda B19",null,null,"H2216KPKR2","H2216KPFKR2","H2216TPKR2","H2216TPFKR2"]
[{"$f":"CONCATENATE(\"Chassis/Power Supply: \",INDEX(Chassis_Definition!A3:A7,'Configure System'!B4))","v":"Chassis/Power Supply: (Select Chassis)"},{"$f":"'Configure System'!E6","v":0},{"$f":"'Configure System'!F6","v":0},{"$f":"'Configure System'!G6","v":0}]
[{"$f":"CONCATENATE(\"Compute Module 1: \",INDEX(Compute_Module!A$2:A$16,'Configure Module 1'!B4))","v":"Compute Module 1: (Select Compute Node)"},{"$f":"'Configure Module 1'!$K$13","v":0},{"$f":"'Configure Module 1'!L13","v":0},{"$f":"'Configure Module 1'!M13","v":0},"Nodo 56c -> 900W",null,null,"H2224KPKR2(1600W)",null,"H2224TPKR2(1600W)"]
[{"$f":"CONCATENATE(\"Compute Module 2: \",INDEX(Compute_Module!A$2:A$16,'Configure Module 2'!B4))","v":"Compute Module 2: (Select Compute Node)"},{"$f":"'Configure Module 2'!$K$13","v":0},{"$f":"'Configure Module 2'!L13","v":0},{"$f":"'Configure Module 2'!M13","v":0},"chassis -> 180",null,null,"H2224KPKR2(2200W)",null,"H2224TPKR2(2200W)"]
[{"$f":"CONCATENATE(\"Compute Module 3: \",INDEX(Compute_Module!A$2:A$16,'Configure Module 3'!B4))","v":"Compute Module 3: (Select Compute Node)"},{"$f":"'Configure Module 3'!$K$13","v":0},{"$f":"'Configure Module 3'!L13","v":0},{"$f":"'Configure Module 3'!M13","v":0}]
{"$rows_left_out":25}
{"sheet":"Configure System","index":3,"n_rows":7,"n_cols":17,"rows_kept":7,"cut":false,"hidden":false,"merged":[]}
["Power Budget","CONFIGURE SYSTEM"]
[null,"Description",null,null,"12V Main (Amps)","12V Stby (Amps)","Power\n(watts)"]
[null,null,null,null,null,null,null,null,null,null,null,null,{"$f":"B3","v":0},null,"  ","  ","  "]
["Define Chassis:",1,null,null,{"$f":"INDEX(Chassis_Definition!L3:L5,B4)","v":0},{"$f":"INDEX(Chassis_Definition!F3:F5,B4)","v":0},{"$f":"(E4*12)+(F4*12)","v":0},null,null,null,null,null,{"$f":"B4","v":1},null,"  ","  ","  "]
[]
[null,"SubTotals:",null,null,{"$f":"SUM(E4:E4)","v":0},{"$f":"SUM(F4:F4)","v":0},{"$f":"SUM(G4:G4)","v":0}]
{"$rows_left_out":2}
{"sheet":"Configure Module 1","index":4,"n_rows":14,"n_cols":22,"rows_kept":14,"cut":false,"hidden":false,"merged":[[1,0,1,12]]}
["Power Budget"]
[{"$f":"CONCATENATE(\"Compute Module 1: \",INDEX(Compute_Module!A$2:A$16,$B4),\" Configuration\")","v":"Compute Module 1: (Select Compute Node) Configuration"},null,null,null,null,null,null,null,null,null,null,null,null,null,"CPU VRM Efficiency","3.3v VRM Efficiency","5v VRM Efficiency"]
[null,"Description",null,"+3.3V (amps)","+5V (amps)"," +12V (amps)","12V CPU1 (amps)","12V CPU2 (amps)","5V \nstby (amps)","Max 3.3v/5v (watts)","12V\nMAIN\n(Amps)","12V\nStby\n(Amps)","Power (Watts)",null,{"$f":"INDEX(Compute_Module!H$2:H$11,$B4)","v":1},{"$f":"INDEX(Compute_Module!I$2:I$11,$B4)","v":1},{"$f":"INDEX(Compute_Module!J$2:J$11,$B4)","v":1}]
["Compute Node:",1,null,{"$f":"INDEX(Compute_Module!B$2:B$16,$B4) *1","v":0},{"$f":"INDEX(Compute_Module!C$2:C$16,$B4) *1","v":0},{"$f":"INDEX(Compute_Module!D2:D14,'Configure Module 1'!B$4)","v":0},null,null,{"$f":"INDEX(Compute_Module!F$2:F$16,$B4) *1","v":0},null,{"$f":"INDEX(Compute_Module!D2:D14,'Configure Module 1'!B$4)","v":0},{"$f":"INDEX(Compute_Module!F$2:F$16,$B4) *1","v":0},{"$f":"INDEX(Compute_Module!G$2:G$16,$B4) *1","v":0},null,null,null,null,null,null,1,{"$f":"IF(AND('Configure System'!B4=2,'Configure Module 1'!B4>=7),\"---> Chassis and node type mismatch\",\"---> Chassis and node type match\")","v":"---> Chassis and node type match"}]
["SSD 1:",1,null,null,null,{"$f":"INDEX(SSD!$D$2:$D$7,'Configure Module 1'!B$5)","v":0},null,null,null,null,{"$f":"INDEX(SSD!$D$2:$D$7,'Configure Module 1'!B$5)","v":0},{"$f":"I5/0.87","v":0},{"$f":"K5*12","v":0},"* Only allowed in 2U node selection",null,null,null,null,null,1]
["SSD 2:",1,null,null,null,{"$f":"INDEX(SSD!$D$2:$D$7,'Configure Module 1'!B$6)","v":0},null,null,null,null,{"$f":"INDEX(SSD!$D$2:$D$7,'Configure Module 1'!B$6)","v":0},{"$f":"I6/0.87","v":0},{"$f":"K6*12","v":0},"* Only allowed in 2U node selection",null,null,null,null,null,1,null,"* Arreglar botón Define hard drive types"]
{"$rows_left_out":9}
{"sheet":"Configure Module 2","index":5,"n_rows":17,"n_cols":22,"rows_kept":17,"cut":false,"hidden":false,"merged":[[1,0,1,12]]}
["Power Budget"]
[{"$f":"CONCATENATE(\"Compute Module 2: \",INDEX(Compute_Module!A$2:A$16,$B4),\" Configuration\")","v":"Compute Module 2: (Select Compute Node) Configuration"},null,null,null,null,null,null,null,null,null,null,null,null,null,"CPU VRM Efficiency","3.3v VRM Efficiency","5v VRM Efficiency"]
[null,"Description",null,"+3.3V (amps)","+5V (amps)"," +12V (amps)","12V CPU1 (amps)","12V CPU2 (amps)","5V \nstby (amps)","Max 3.3v/5v (watts)","12V\nMAIN\n(Amps)","12V\nStby\n(Amps)","Power (Watts)",null,{"$f":"INDEX(Compute_Module!H$2:H$11,$B4)","v":1},{"$f":"INDEX(Compute_Module!I$2:I$11,$B4)","v":1},{"$f":"INDEX(Compute_Module!J$2:J$11,$B4)","v":1}]
["Compute Node:",1,null,{"$f":"INDEX(Compute_Module!B$2:B$16,$B4) *1","v":0},{"$f":"INDEX(Compute_Module!C$2:C$16,$B4) *1","v":0},{"$f":"INDEX(Compute_Module!D2:D14,'Configure Module 2'!B$4)","v":0},null,null,{"$f":"INDEX(Compute_Module!F$2:F$16,$B4) *1","v":0},null,{"$f":"INDEX(Compute_Module!D2:D14,'Configure Module 2'!B$4)","v":0},{"$f":"INDEX(Compute_Module!F$2:F$16,$B4) *1","v":0},{"$f":"INDEX(Compute_Module!G$2:G$16,$B4) *1","v":0},null,null,null,null,null,null,1,{"$f":"IF(AND('Configure System'!B4=2,'Configure Module 1'!B4>=7),\"---> Chassis and node type mismatch\",\"---> Chassis and node type match\")","v":"---> Chassis and node type match"}]
["SSD 1:",1,null,null,null,{"$f":"INDEX(SSD!$D$2:$D$7,'Configure Module 2'!B$5)","v":0},null,null,null,null,{"$f":"INDEX(SSD!$D$2:$D$7,'Configure Module 2'!B$5)","v":0},{"$f":"I5/0.87","v":0},{"$f":"K5*12","v":0},"* Only allowed in 2U node selection",null,null,null,null,null,1]
["SSD 2:",1,null,null,null,{"$f":"INDEX(SSD!$D$2:$D$7,'Configure Module 2'!B$6)","v":0},null,null,null,null,{"$f":"INDEX(SSD!$D$2:$D$7,'Configure Module 2'!B$6)","v":0},{"$f":"I6/0.87","v":0},{"$f":"K6*12","v":0},"* Only allowed in 2U node selection",null,null,null,null,null,1,null,"* Arreglar botón Define hard drive types"]
{"$rows_left_out":12}
{"sheet":"Configure Module 3","index":6,"n_rows":14,"n_cols":20,"rows_kept":14,"cut":false,"hidden":false,"merged":[[1,0,1,12]]}
["Power Budget"]
[{"$f":"CONCATENATE(\"Compute Module 3: \",INDEX(Compute_Module!A$2:A$16,$B4),\" Configuration\")","v":"Compute Module 3: (Select Compute Node) Configuration"},null,null,null,null,null,null,null,null,null,null,null,null,null,"CPU VRM Efficiency","3.3v VRM Efficiency","5v VRM Efficiency"]
[null,"Description",null,"+3.3V (amps)","+5V (amps)"," +12V (amps)","12V CPU1 (amps)","12V CPU2 (amps)","5V \nstby (amps)","Max 3.3v/5v (watts)","12V\nMAIN\n(Amps)","12V\nStby\n(Amps)","Power (Watts)",null,{"$f":"INDEX(Compute_Module!H$2:H$11,$B4)","v":1},{"$f":"INDEX(Compute_Module!I$2:I$11,$B4)","v":1},{"$f":"INDEX(Compute_Module!J$2:J$11,$B4)","v":1}]
["Compute Node:",1,null,{"$f":"INDEX(Compute_Module!B$2:B$16,$B4) *1","v":0},{"$f":"INDEX(Compute_Module!C$2:C$16,$B4) *1","v":0},{"$f":"INDEX(Compute_Module!D2:D14,'Configure Module 3'!B$4)","v":0},null,null,{"$f":"INDEX(Compute_Module!F$2:F$16,$B4) *1","v":0},null,{"$f":"INDEX(Compute_Module!D2:D14,'Configure Module 3'!B$4)","v":0},{"$f":"INDEX(Compute_Module!F$2:F$16,$B4) *1","v":0},{"$f":"INDEX(Compute_Module!G$2:G$16,$B4) *1","v":0},null,null,null,null,null,null,1]
["SSD 1:",1,null,null,null,{"$f":"INDEX(SSD!$D$2:$D$7,'Configure Module 3'!B$5)","v":0},null,null,null,null,{"$f":"INDEX(SSD!$D$2:$D$7,'Configure Module 3'!B$5)","v":0},{"$f":"I5/0.87","v":0},{"$f":"K5*12","v":0},"* Only allowed in 2U node selection",null,null,null,null,null,1]
["SSD 2:",1,null,null,null,{"$f":"INDEX(SSD!$D$2:$D$7,'Configure Module 3'!B$6)","v":0},null,null,null,null,{"$f":"INDEX(SSD!$D$2:$D$7,'Configure Module 3'!B$6)","v":0},{"$f":"I6/0.87","v":0},{"$f":"K6*12","v":0},"* Only allowed in 2U node selection",null,null,null,null,null,1]
{"$rows_left_out":9}
{"sheet":"Configure Module 4","index":7,"n_rows":14,"n_cols":20,"rows_kept":14,"cut":false,"hidden":false,"merged":[[1,0,1,12]]}
["Power Budget"]
[{"$f":"CONCATENATE(\"Compute Module 4: \",INDEX(Compute_Module!A$2:A$16,$B4),\" Configuration\")","v":"Compute Module 4: (Select Compute Node) Configuration"},null,null,null,null,null,null,null,null,null,null,null,null,null,"CPU VRM Efficiency","3.3v VRM Efficiency","5v VRM Efficiency"]
[null,"Description",null,"+3.3V (amps)","+5V (amps)"," +12V (amps)","12V CPU1 (amps)","12V CPU2 (amps)","5V \nstby (amps)","Max 3.3v/5v (watts)","12V\nMAIN\n(Amps)","12V\nStby\n(Amps)","Power (Watts)",null,{"$f":"INDEX(Compute_Module!H$2:H$11,$B4)","v":1},{"$f":"INDEX(Compute_Module!I$2:I$11,$B4)","v":1},{"$f":"INDEX(Compute_Module!J$2:J$11,$B4)","v":1}]
["Compute Node:",1,null,{"$f":"INDEX(Compute_Module!B$2:B$16,$B4) *1","v":0},{"$f":"INDEX(Compute_Module!C$2:C$16,$B4) *1","v":0},{"$f":"INDEX(Compute_Module!D2:D14,'Configure Module 4'!B$4)","v":0},null,null,{"$f":"INDEX(Compute_Module!F$2:F$16,$B4) *1","v":0},null,{"$f":"INDEX(Compute_Module!D2:D14,'Configure Module 4'!B$4)","v":0},{"$f":"INDEX(Compute_Module!F$2:F$16,$B4) *1","v":0},{"$f":"INDEX(Compute_Module!G$2:G$16,$B4) *1","v":0},null,null,null,null,null,null,1]
["SSD 1:",1,null,null,null,{"$f":"INDEX(SSD!$D$2:$D$7,'Configure Module 4'!B$5)","v":0},null,null,null,null,{"$f":"INDEX(SSD!$D$2:$D$7,'Configure Module 4'!B$5)","v":0},{"$f":"I5/0.87","v":0},{"$f":"K5*12","v":0},"* Only allowed in 2U node selection",null,null,null,null,null,1]
["SSD 2:",1,null,null,null,{"$f":"INDEX(SSD!$D$2:$D$7,'Configure Module 4'!B$6)","v":0},null,null,null,null,{"$f":"INDEX(SSD!$D$2:$D$7,'Configure Module 4'!B$6)","v":0},{"$f":"I6/0.87","v":0},{"$f":"K6*12","v":0},"* Only allowed in 2U node selection",null,null,null,null,null,1]
{"$rows_left_out":9}
{"sheet":"Compute_Module","index":8,"n_rows":14,"n_cols":14,"rows_kept":14,"cut":false,"hidden":true,"merged":[]}
["Compute Node",3.3,5,"12BB",-12,"12VSB","Watts","CPU\nVRM%","5v\nVRM%","3v\nVRM%","MAX DIMM/socket",null,null,"* 5VStby only for ATX PSUs"]
["(Select Compute Node)",null,null,null,null,null,null,1,1,1]
["S9256WK1HLC",null,null,76.7,null,null,{"$f":"B3*3.3+C3*5+D3*12+E3*12+F3*5","v":920.40000000000009},0.93,0.85,0.85,24]
["S9248WK1HLC",null,null,67.599999999999994,null,null,{"$f":"B4*3.3+C4*5+D4*12+E4*12+F4*5","v":811.19999999999993},0.93,0.85,0.85,24]
["S9232WK1HLC",null,null,49.2,null,null,590.40000000000009,0.93,0.85,0.85,24]
["S9232WK1HAC",null,null,49.2,null,null,{"$f":"B6*3.3+C6*5+D6*12+E6*12+F6*5","v":590.40000000000009},0.93,0.85,0.85,24]
{"$rows_left_out":9}
{"sheet":"Chassis_Definition","index":9,"n_rows":12,"n_cols":15,"rows_kept":12,"cut":false,"hidden":true,"merged":[[0,12,0,13],[0,1,0,6],[10,9,10,10]]}
["Chassis","PS limits",null,null,null,null,null,"Max W","Total","80mm Fans","60mm fans","TOTAL","PS Eff%"]
["Selection","Form factor","5V","12V\n240V AC","12V\n115V AC","12VStby","5VSB","3.3v/5v","Watts","12V","12V",null,"240v","110v"]
["(Select Chassis)",null,null,0,0,0,null,null,null,0,null,null,1,1]
["FC2HLC21W3 (Liquid Cooled / 2100W (x3) PSUs)","2U",null,175,84,3.5,null,null,{"$f":"(D4*12)","v":2100},0,14.92,{"$f":"SUM(J4:K4)","v":14.92},0.94]
["FC2HAC16W3 (Air Cooled / 1600W (x3) PSUs)","2U",null,133,84,3.5,null,null,{"$f":"(D5*12)","v":1596},13.78,14.92,{"$f":"SUM(J5:K5)","v":28.7},0.96]
["User Definable",null,null,null,null,null,null,null,null,null,null,null,null,null,"<-- Define Custom Numbers Here"]
{"$rows_left_out":7}
{"sheet":"Processors","index":10,"n_rows":62,"n_cols":7,"rows_kept":62,"cut":false,"hidden":true,"merged":[]}
["Processor Types","TDP (W)","HS Fan (A)","Source",null,null,"CLST Saving"]
["(Select Processor)"]
["Intel(R) Xeon(R) Platinum 9222 CPU (250W)",250,null,null,null,45,87]
["Intel(R) Xeon(R) Platinum 9242 CPU (350W)",350,null,null,null,40,{"$f":"(B4-F4)*0.8","v":248}]
["Intel(R) Xeon(R) Platinum 9282 CPU (400W)",400,null,null,null,40,68]
[null,null,null,null,null,40,87]
{"$rows_left_out":57}
{"sheet":"Memory","index":11,"n_rows":29,"n_cols":20,"rows_kept":29,"cut":false,"hidden":false,"merged":[[1,16,1,19],[1,1,1,9],[1,12,1,13],[1,14,1,15],[0,1,0,9]]}
[null,"Watts of +12V"]
[null,"# of DIMMS",null,null,null,null,null,null,null,null,null,null,"Hi Stress DIMM P",null,"Min Throtted P",null,"CLST Saving"]
["Memory",1,8,16,24,null,null,null,null,null,null,null,"1DPC","2DPC","1DPC","2DPC",1,2,4,8]
["(Select Memory)"]
["8GB DDR4 RDIMM (8Gb, 1Rx8)",4.08,{"$f":"B5*C$3","v":32.64},{"$f":"B5*D$3","v":65.28},{"$f":"B5*E$3","v":97.92},null,null,null,null,null,null,null,3,2.2999999999999998,2,1.6,{"$f":"B5-O5","v":2.08},{"$f":"(M5-O5)*2","v":2},{"$f":"(M5-O5)*4","v":4},{"$f":"(N5-P5)*8","v":5.5999999999999979}]
["16GB DDR4 RDIMM (16Gb 1Rx16)",5.69,45.52,91.04,136.56,null,null,null,null,null,null,null,4,3,2.2000000000000002,2,{"$f":"B6-O6","v":3.49},{"$f":"(M6-O6)*2","v":3.5999999999999996},{"$f":"(M6-O6)*4","v":7.1999999999999993},{"$f":"(N6-P6)*8","v":8}]
{"$rows_left_out":24}
{"sheet":"PCIe","index":12,"n_rows":24,"n_cols":8,"rows_kept":24,"cut":false,"hidden":false,"merged":[]}
["PCIe slot 1 Add in Cards","Amps of +3.3V","Amps of +5V","Amps of +12VBB","Amps of    -12V","Watts"]
["Slot Empty",null,null,null,null," "]
["PCIe 5W",null,null,0.44,null,{"$f":"B3*3.3+C3*5+D3*12+E3*12","v":5.28},null,"Specs needed to get the power consumption"]
["PCIe12W",null,null,0.83,null,9.9599999999999991]
["PCIe 15W",null,null,1.25,null,15]
["PCIe 20W",null,null,1.85]
{"$rows_left_out":19}
{"sheet":"SSD","index":13,"n_rows":24,"n_cols":8,"rows_kept":24,"cut":false,"hidden":false,"merged":[]}
["PCIe SSD","Amps of +3.3V","Amps of +5V","Amps of +12V","Watts"]
["Empty",null,null,null,{"$f":"C2*5+D2*12","v":0}]
["Intel® SSD DC P4510/4610 Series 2.5\" FF, 2.0TB (25W)",null,null,2.08,24.96,null,"Review with Martin series available for WKP and specs"]
["Intel® SSD DC P4800X Series 2.5\" FF, 2.0TB (18W)",null,null,0.67,{"$f":"C4*5+D4*12","v":8.0400000000000009}]
["User Definable",null,null,null,0,"<-- Define Custom Device Here"]
["User Definable",null,null,null,0,"<-- Define Custom Device Here"]
{"$rows_left_out":19}
{"sheet":"Peripherals","index":14,"n_rows":16,"n_cols":10,"rows_kept":16,"cut":false,"hidden":true,"merged":[]}
["Misc Peripherals","Amps of +3.3V","Amps of +5V","Amps of +12V","Amps of    -12V","Amps of 3vsb","Watts"]
["Slim-Line Devices"]
["Empty"]
["RMM4LITE2",null,null,null,null,null,{"$f":"B4*3.3+C4*5+D4*12+E4*12+F4*5","v":0},"<-- Define Custom Peripherals Here",null,"* Need VROC and RMM spec"]
["VROC",null,null,null,null,null,{"$f":"B5*3.3+C5*5+D5*12+E5*12+F5*5","v":0},"<-- Define Custom Peripherals Here"]
["User Definable",null,null,null,null,null,{"$f":"B6*3.3+C6*5+D6*12+E6*12+F6*5","v":0},"<-- Define Custom Peripherals Here"]
{"$rows_left_out":11}
{"sheet":"Taylor Pass_Normal","index":15,"n_rows":30,"n_cols":17,"rows_kept":30,"cut":false,"hidden":true,"merged":[[16,0,18,0],[19,0,21,0],[22,0,26,0],[27,0,29,0],[0,0,0,1],[4,0,15,0],[0,2,0,5],[0,11,0,15],[1,0,2,0],[3,2,3,5],[3,6,3,10],[3,11,3,15],[0,6,0,10]]}
["Notes:\n1.  27°C is limited to elevations of 900m or less\n2.  Quad Port IO Modules cannot be installed simultaneously with PCI Cards.\n3.  Processor - may have significent performance impact.\n4.  Processors - There may be some performance impact during fan failures.\n5.  For A3/A4 individual PS selection:\n      1) For dual power supply configuration, power budget must fit within single power supply rated load and be installed in dual configuration\n      2) For single power supply configuration, power budget must be sized with 30% margin to single power supply rated load.\n6.  When identifying memory in the table, only Rank and Width are required.  Capacity is not required.\n7.  Processor limited to 90W to support 1.5W AOC cable. Processor limited to 90W and memory limited to DRx4 to support 2W AOC cable. \n8. Supported with one HDD per node configuration.",null,"Base System SKUs:\nH2216TLP",null,null,null,"Base System SKUs:\nH2312TLP",null,null,null,null,"Base System SKUs:\nH2224TLP"]
["ASHRAE (See note 1)","Classifications","A2","27C","A3","A4","27C","A2","A2","A3","A4","27C","A2","A2","A3","A4"]
[null,"Max Ambient","35C","27C","40C","45C","27C","35C","35C","40C","45C","27C","35C","35C","40C","45C","<-- See note 1"]
["PS (See note 5)","Power Supplies","See Note 5",null,null,null,"See Note 5",null,null,null,null,"See Note 5"]
["EP Processors (See notes 3 and 4)","EP, 135w, 12C  (Intel® Xeon® processor E5-2690 V3)","●","●","●",null,"●",null,"●",null,"","●",null,"●",null,""]
[null,"EP, 120w, 12C  (Intel® Xeon® processor E5-2680 V3, E5-2670 V3)","●","●","●",null,"●",null,"●",null,"","●",null,"●",null,""]
{"$rows_left_out":25}
{"sheet":"Taylor Pass_Fan Fail","index":16,"n_rows":30,"n_cols":8,"rows_kept":30,"cut":false,"hidden":true,"merged":[[16,0,18,0],[19,0,21,0],[22,0,26,0],[27,0,29,0],[4,0,15,0],[0,3,0,4],[0,5,0,6],[1,0,2,0],[3,3,3,4],[3,5,3,6],[0,0,0,1]]}
["Notes:\n1.  27°C is limited to elevations of 900m or less\n2.  Quad Port IO Modules cannot be installed simultaneously with PCI Cards.\n3.  Processor - 135W - 4/6/8/16C, 120W-14C and 145W - 14/18C may have some performance impact.\n4.  Processors - There may be some performance impact during fan failures.\n5.  For A3/A4 individual PS selection:\n      1) For dual power supply configuration, power budget must fit within single power supply rated load and be installed in dual configuration, or\n      2) For single power supply configuration, power budget must be sized with 30% margin to single power supply rated load.\n6.  When identifying memory in the table, only Rank and Width are required.  Capacity is not required.\n7.  Processor limited to 90W to support 1.5W AOC cable. Processor limited to 90W and memory limited to DRx4 to support 2W AOC cable. \n8. Fan fail is not supported at A3/A4",null,"Base System SKUs:\nR2216TLP","Base System SKUs:\nR2312TLP",null,"Base System SKUs:\nR2224TLP"]
["ASHRAE (See note 1)","Classifications","A2","27C","A2","27C","A2"]
[null,"Max Ambient","35C","27C","35C","27C","35C","<-- See note 1"]
["PS (See note 5)","Power Supplies","See Note 5","See Note 5",null,"See Note 5"]
["EP Processors (See notes 3 and 4)","EP, 135w, 12C  (Intel® Xeon® processor E5-2690 V3)","3,4","3,4","3,4","3,4","3,4"]
[null,"EP, 120w, 12C  (Intel® Xeon® processor E5-2680 V3, E5-2670 V3)","3,4","3,4","3,4","3,4","3,4"]
{"$rows_left_out":25}
{"sheet":"Walker Pass_Normal","index":17,"n_rows":33,"n_cols":31,"rows_kept":33,"cut":false,"hidden":false,"merged":[[9,0,18,0],[19,0,20,0],[23,0,30,0],[1,9,1,10],[1,11,1,12],[1,13,1,14],[1,27,1,30],[4,0,5,0],[1,0,1,2],[1,3,1,4],[1,5,1,6],[1,7,1,8]]}
[]
[" Thermal Config Matrix                                                           Normal operating mode                                                                                                                                                                                                                       \"●\"= Full Support without limitation;                              \n\" \"(Blank)=Not support; ",null,null,"1U LC - 4 sleds",null,"2U LC - 2 sleds",null,"2U AC - 2 sleds",null,"1U AC - 4 sleds ",null,"1U/2U AC- Combined",null,"1U/2U LC -Combined ",null,null,null,null,null,null,null,null,null,null,null,null,null,"WCP"]
["ASHRAE (See note1, 2)",null,"Max Ambient","27°C","35°C","27°C","35°C","27°C","35°C","27°C","35°C ","27°C","35°C ","27°C","35°C ",null,null,null,null,null,null,null,null,null,null,null,null,"27°C(1)","35°C","40°C","45°C"]
[null,null,"Altitude",900,900,900,900,900,900,900,900,900,900,900,900]
["PSU ",null,"1600 W AC","●","●","●","●","●","●","TBD","TBD","TBD","TBD","●","●"]
[null,null,"2100 W AC","●","●","●","●","●","●","TBD","TBD","TBD","TBD","●","●",null,null,null,null,null,null,null,null,null,null,null,null,"●","●","●","●"]
{"$rows_left_out":28}
{"sheet":"Walker Pass_Fan Fail","index":18,"n_rows":33,"n_cols":31,"rows_kept":33,"cut":false,"hidden":false,"merged":[[1,27,1,30],[4,0,5,0],[9,0,18,0],[19,0,20,0],[23,0,30,0],[1,7,1,8],[1,9,1,10],[1,11,1,12],[1,13,1,14],[1,0,1,2],[1,3,1,4],[1,5,1,6]]}
[]
[" Thermal Config Matrix                                                           Normal operating mode                                                                                                                                                                                                                       \"●\"= Full Support without limitation;                              \n\" \"(Blank)=Not support; ",null,null,"1U LC - 4 sleds",null,"2U LC - 2 sleds",null,"2U AC - 2 sleds",null,"1U AC - 4 sleds ",null,"1U/2U AC- Combined",null,"1U/2U LC -Combined ",null,null,null,null,null,null,null,null,null,null,null,null,null,"WCP"]
["ASHRAE (See note1, 2)",null,"Max Ambient","27°C","35°C","27°C","35°C","27°C","35°C","27°C","35°C ","27°C","35°C ","27°C","35°C ",null,null,null,null,null,null,null,null,null,null,null,null,"27°C(1)","35°C","40°C","45°C"]
[null,null,"Altitude",900,900,900,900,900,900,900,900,900,900,900,900]
["PSU ",null,"1600 W AC","●","●","●","●","●","●","TBD","TBD","TBD","TBD","●","●"]
[null,null,"2100 W AC","●","●","●","●","●","●","TBD","TBD","TBD","TBD","●","●",null,null,null,null,null,null,null,null,null,null,null,null,"●","●","●","●"]
{"$rows_left_out":28}
{"sheet":"Revision","index":19,"n_rows":4,"n_cols":4,"rows_kept":4,"cut":false,"hidden":true,"merged":[]}
[{"$f":"MAX(A4:A24)","v":"2019-10-29"},{"$f":"MAX(B4:B24)","v":1},null,"<=== Linked to Summary Tab."]
[]
["Date","Rev","Notes","Init"]
["2019-10-29",1,"Initial Release."]

{"sheet":"Macro1","index":20,"n_rows":0,"n_cols":0,"rows_kept":0,"cut":false,"hidden":true,"merged":[]}